MPI Compilation of LSDALTON in DALTON2015.1 Failed

Problems with Dalton installation? Find answers or ask for help here
Post Reply
xiongyan21
Posts: 184
Joined: 24 Sep 2014, 08:36
First name(s): yan
Last name(s): xiong
Affiliation: CENTRAL CHINA NORMAL UNIVERSITY
Country: China

MPI Compilation of LSDALTON in DALTON2015.1 Failed

Post by xiongyan21 » 20 Dec 2015, 03:41

[ 85%] Building Fortran object CMakeFiles/declib.dir/LSDALTON/deccc/rpa.F90.o

path/DALTON/LSDALTON/deccc/rpa.F90:532.46:

call mo_work_dist(nv*nv*no,fri,tri,trafoi,nod)
1
/path/computation1/DALTON/LSDALTON/deccc/rpa.F90:531.19:

do nod=1,nnod-1
2
Error: Variable 'nod' at (1) not definable inside loop beginning at (2) as INTENT(INOUT) argument to subroutine 'mo_work_dist'
/path/DALTON/LSDALTON/deccc/rpa.F90:569.46:

call mo_work_dist(nv*no*no,fri,tri,trafoi,nod)
1
/path/DALTON/LSDALTON/deccc/rpa.F90:568.19:

do nod=1,nnod-1
2
Error: Variable 'nod' at (1) not definable inside loop beginning at (2) as INTENT(INOUT) argument to subroutine 'mo_work_dist'
/path/DALTON/LSDALTON/deccc/rpa.F90:1664:6:

use rpa_module
1
Fatal Error: Can't open module file 'rpa_module.mod' for reading at (1): No such file or directory
compilation terminated.
make[3]: *** [CMakeFiles/declib.dir/LSDALTON/deccc/rpa.F90.o] Error 1
make[2]: *** [CMakeFiles/declib.dir/LSDALTON/deccc/rpa.F90.o.provides] Error 2
make[1]: *** [CMakeFiles/declib.dir/all] Error 2
make: *** [all] Error 2
BASH-3.2#

But the MPI compilation of DIRAC2015.0 has been successful.

Post Reply

Who is online

Users browsing this forum: No registered users and 2 guests