problem in make

Problems with Dalton installation? Find answers or ask for help here
Post Reply
ychuang
Posts: 2
Joined: 09 Oct 2015, 14:02
First name(s): john
Last name(s): chuang
Affiliation: national university of kaohsiung
Country: Taiwan, Province of China

problem in make

Post by ychuang » 10 Oct 2015, 04:31

Dear all

I am trying to compile DALTON2015 software program and ran into the following error message

: catastrophic error: **Internal compiler error: internal abort** Please report this error along with the circumstances in which it occurred in a Software Problem Report. Note: File and line given may not be explicit cause of this error.
compilation aborted for /home/ychuang/QM/DALTON/DALTON-Source/DALTON/choles/cc_cholesky.F (code 1)
make[2]: *** [CMakeFiles/dalton.dir/DALTON/choles/cc_cholesky.F.o] Error 1
make[1]: *** [CMakeFiles/dalton.dir/all] Error 2
make: *** [all] Error 2

I am using INTEL composer_xe 2013.3.163 compiler

any suggestion will be helpful

bast
Posts: 1197
Joined: 26 Aug 2013, 13:22
First name(s): Radovan
Last name(s): Bast
Affiliation: none
Country: Germany

Re: problem in make

Post by bast » 11 Oct 2015, 18:27

dear John,

one possible way out is to lower optimization for that particular file.
and the way i would do it is this:
1) compile with "make VERBOSE=1"
2) at some point compilation stops with the error that you have reported
3) copy paste the compilation command for that one file and change -O3 to -O0 (change three to zero).
4) hopefully the single file will then compile
5) compile the rest of the code with "make"

good luck!
radovan

ychuang
Posts: 2
Joined: 09 Oct 2015, 14:02
First name(s): john
Last name(s): chuang
Affiliation: national university of kaohsiung
Country: Taiwan, Province of China

Re: problem in make

Post by ychuang » 12 Oct 2015, 05:12

Dear Radovan

Thanks for your reply.
It works like a charm.

John

bast
Posts: 1197
Joined: 26 Aug 2013, 13:22
First name(s): Radovan
Last name(s): Bast
Affiliation: none
Country: Germany

Re: problem in make

Post by bast » 12 Oct 2015, 08:47

dear John,
great. glad it worked.
best wishes,
radovan

saisudhakar
Posts: 12
Joined: 13 Nov 2015, 05:49
First name(s): Saisudhakar
Last name(s): Mukka
Affiliation: Birla Institute of Technology and Science
Country: India

Re: problem in make

Post by saisudhakar » 17 Nov 2015, 05:50

I have the same problem as like John. So used make VERBOSE=1 command as mentioned by Radovan. Observed error as reported by John. It is not clear to me. What to do next? Help would be grateful for me.


Thanking you
Saisudhakar

bast
Posts: 1197
Joined: 26 Aug 2013, 13:22
First name(s): Radovan
Last name(s): Bast
Affiliation: none
Country: Germany

Re: problem in make

Post by bast » 17 Nov 2015, 10:06

saisudhakar wrote:I have the same problem as like John. So used make VERBOSE=1 command as mentioned by Radovan. Observed error as reported by John. It is not clear to me. What to do next? Help would be grateful for me.


Thanking you
Saisudhakar
what are the last few lines that you see when the compilation stops?

Post Reply

Who is online

Users browsing this forum: No registered users and 2 guests